HOHfO anion

Gas phase ion energetics data

Data compiled by: John E. Bartmess

Electron affinity of neutral species

EAneutral (eV) Method Reference Comment
1.730 ± 0.050LPESLi, Zheng, et al., 2012

References

Li, Zheng, et al., 2012
Li, X.; Zheng, W.J.; Buonaugurio, A.; Buytendyk, A.; Bowen, K.; Balasubramanian, K., Photoelectron spectroscopy of the molecular anions, ZrO-, HfO-, HfHO-, and HfO2H-, J. Chem. Phys., 2012, 136, 15, 154306, https://doi.org/10.1063/1.4704127 . [all data]