RhB9 anion

Gas phase ion energetics data

Data compiled by: John E. Bartmess

Electron affinity of neutral species

EAneutral (eV) Method Reference Comment
2.860 ± 0.030LPESLi, Romanescu, et al., 2012

References

Li, Romanescu, et al., 2012
Li, W.L.; Romanescu, C.; Galeev, T.R.; Piazza, Z.A.; Boldyrev, A.I.; Wang, L.S., Transition-Metal-Centered Nine-Membered Boron Rings: M (c) B-9 and M (c) B-9(-) (M = Rh, Ir), J. Am. Chem. Soc., 2012, 134, 1, 165-168, https://doi.org/10.1021/ja209808k . [all data]