ICN radical anion

Gas phase ion energetics data

Data compiled by: John E. Bartmess

Electron affinity of neutral species

EAneutral (eV) Method Reference Comment
1.345 ± 0.040LPESMiller, Sheps, et al., 2012

References

Miller, Sheps, et al., 2012
Miller, E.M.; Sheps, L.; Lu, Y.J.; Case, A.S.; McCoy, A.B.; Lineberger, W.C., New view of the ICN A continuum using photoelectron spectroscopy of ICN-, J. Chem. Phys., 2012, 136, 4, 044313, https://doi.org/10.1063/1.3679170 . [all data]