nBuNO2 radical anion

Gas phase ion energetics data

Data compiled by: John E. Bartmess

Electron affinity of neutral species

EAneutral (eV) Reference Comment
0.2400 ± 0.0060Adams, Knurr, et al., 2012Vertical Detachment Energy: 0.88±0.05 eV

References

Adams, Knurr, et al., 2012
Adams, C.L.; Knurr, B.J.; Weber, J.M., Photoelectron spectroscopy of 1-nitropropane and 1-nitrobutane anions, J. Chem. Phys., 2012, 136, 6, 064307, https://doi.org/10.1063/1.3683250 . [all data]