fluorenide anion

Gas phase ion energetics data

Data compiled by: John E. Bartmess

Protonation reactions

C13H9- + Hydrogen cation = Fluorene

By formula: C13H9- + H+ = C13H10

Quantity Value Units Method Reference Comment
Δr1466. ± 8.4kJ/molD-EARömer, Janaway, et al., 1997gas phase
Δr1472. ± 8.8kJ/molG+TSTaft and Bordwell, 1988gas phase
Δr1478. ± 11.kJ/molG+TSCumming and Kebarle, 1978gas phase
Quantity Value Units Method Reference Comment
Δr1434. ± 8.8kJ/molH-TSRömer, Janaway, et al., 1997gas phase
Δr1439. ± 8.4kJ/molIMRETaft and Bordwell, 1988gas phase
Δr1446. ± 8.4kJ/molIMRECumming and Kebarle, 1978gas phase

References

Römer, Janaway, et al., 1997
Römer, B.; Janaway, G.; Brauman, J.I., Cyclopentadienyl, Indenyl, and Fluorenyl Anions: Gas-Phase and Solvation Energy Contributions to Electron Detachment Energies, J. Am. Chem. Soc., 1997, 119, 9, 2249, https://doi.org/10.1021/ja961947x . [all data]

Taft and Bordwell, 1988
Taft, R.W.; Bordwell, F.G., Structural and Solvent Effects Evaluated from Acidities Measured in Dimethyl Sulfoxide and in the Gas Phase, Acc. Chem. Res., 1988, 21, 12, 463, https://doi.org/10.1021/ar00156a005 . [all data]

Cumming and Kebarle, 1978
Cumming, J.B.; Kebarle, P., Summary of gas phase measurements involving acids AH. Entropy changes in proton transfer reactions involving negative ions. Bond dissociation energies D(A-H) and electron affinities EA(A), Can. J. Chem., 1978, 56, 1. [all data]