Pb7S7 anion

Gas phase ion energetics data

Data compiled by: John E. Bartmess

Electron affinity of neutral species

EAneutral (eV) Method Reference Comment
2.01 ± 0.10LPESKoirala, Kiran, et al., 2011Vertical Detachment Energy: 2.22±0.05 eV. EA taken as E for 10% of main peak height.

References

Koirala, Kiran, et al., 2011
Koirala, P.; Kiran, B.; Kandalam, A.K.; Fancher, C.A.; de Clercq, H.L.; Li, X.; Bowen, K.H., Structural evolution and stabilities of neutral and anionic clusters of lead sulfide: Joint anion photoelectron and computational studies, J. Chem. Phys., 2011, 135, 13, 134311, https://doi.org/10.1063/1.3635406 . [all data]