pSO2Me-C6H4CH2 anion

Reaction thermochemistry data

Data compiled by: John E. Bartmess

Individual Reactions

C8H9O2S- + Hydrogen cation = Benzene, 1-methyl-4-(methylsulfonyl)-

By formula: C8H9O2S- + H+ = C8H10O2S

Quantity Value Units Method Reference Comment
Δr358.8 ± 2.1kcal/molG+TSTaft and Topsom, 1987gas phase; value altered from reference due to change in acidity scale
Quantity Value Units Method Reference Comment
Δr352.1 ± 2.0kcal/molIMRETaft and Topsom, 1987gas phase; value altered from reference due to change in acidity scale

Gas phase ion energetics data

Data compiled by: John E. Bartmess

Protonation reactions

C8H9O2S- + Hydrogen cation = Benzene, 1-methyl-4-(methylsulfonyl)-

By formula: C8H9O2S- + H+ = C8H10O2S

Quantity Value Units Method Reference Comment
Δr358.8 ± 2.1kcal/molG+TSTaft and Topsom, 1987gas phase; value altered from reference due to change in acidity scale
Quantity Value Units Method Reference Comment
Δr352.1 ± 2.0kcal/molIMRETaft and Topsom, 1987gas phase; value altered from reference due to change in acidity scale

References

Taft and Topsom, 1987
Taft, R.W.; Topsom, R.D., The Nature and Analysis of Substituent Effects, Prog. Phys. Org. Chem., 1987, 16, 1. [all data]