HoBr4 anion

Gas phase thermochemistry data

Data compiled by: John E. Bartmess

Quantity Value Units Method Reference Comment
Δfgas-259.3 ± 5.5kcal/molTherButman, Kudin, et al., 2009value altered from reference due to conversion from electron convention to ion convention

References

Butman, Kudin, et al., 2009
Butman, M.F.; Kudin, L.S.; Motalov, V.B.; Kryuchkov, A.S.; Grishin, A.E.; Kramer, K.W., The Molecular and Ionic Sublimation of Holmium Tribromide, Russ. J. Phys. Chem., 2009, 83, 2, 158-166, https://doi.org/10.1134/S0036024409020034 . [all data]