mCONMe2-C6H4CH2 anion

Reaction thermochemistry data

Data compiled by: John E. Bartmess

Individual Reactions

C10H12NO- + Hydrogen cation = Benzamide, N,N,3-trimethyl-

By formula: C10H12NO- + H+ = C10H13NO

Quantity Value Units Method Reference Comment
Δr1564. ± 8.8kJ/molG+TSTaft, 1987gas phase; value altered from reference due to change in acidity scale
Quantity Value Units Method Reference Comment
Δr1536. ± 8.4kJ/molIMRETaft, 1987gas phase; value altered from reference due to change in acidity scale

Gas phase ion energetics data

Data compiled by: John E. Bartmess

Protonation reactions

C10H12NO- + Hydrogen cation = Benzamide, N,N,3-trimethyl-

By formula: C10H12NO- + H+ = C10H13NO

Quantity Value Units Method Reference Comment
Δr1564. ± 8.8kJ/molG+TSTaft, 1987gas phase; value altered from reference due to change in acidity scale
Quantity Value Units Method Reference Comment
Δr1536. ± 8.4kJ/molIMRETaft, 1987gas phase; value altered from reference due to change in acidity scale

References

Taft, 1987
Taft, R.W., The Nature and Analysis of Substitutent Electronic Effects, Personal communication. See also Prog. Phys. Org. Chem., 1987, 16, 1. [all data]