pCF3-C6H4CH2 anion

Reaction thermochemistry data

Data compiled by: John E. Bartmess

Individual Reactions

C8H6F3- + Hydrogen cation = C8H7F3

By formula: C8H6F3- + H+ = C8H7F3

Quantity Value Units Method Reference Comment
Δr1536. ± 8.8kJ/molG+TSCaldwell and Bartmessgas phase; value altered from reference due to change in acidity scale
Quantity Value Units Method Reference Comment
Δr1505. ± 8.4kJ/molIMRECaldwell and Bartmessgas phase; value altered from reference due to change in acidity scale

Gas phase ion energetics data

Data compiled by: John E. Bartmess

Protonation reactions

C8H6F3- + Hydrogen cation = C8H7F3

By formula: C8H6F3- + H+ = C8H7F3

Quantity Value Units Method Reference Comment
Δr1536. ± 8.8kJ/molG+TSCaldwell and Bartmessgas phase; value altered from reference due to change in acidity scale
Quantity Value Units Method Reference Comment
Δr1505. ± 8.4kJ/molIMRECaldwell and Bartmessgas phase; value altered from reference due to change in acidity scale

References

Caldwell and Bartmess
Caldwell, G.; Bartmess, J.E., , Unpublished results. [all data]