tetra(2,2')thiophene radical anion

Gas phase ion energetics data

Data compiled by: John E. Bartmess

Electron affinity of neutral species

EAneutral (eV) Method Reference Comment
0.940 ± 0.030LPESSiegert, Vogeler, et al., 2011Neutral triplet state up 1.75 eV

References

Siegert, Vogeler, et al., 2011
Siegert, S.; Vogeler, F.; Marian, C.M.; Weinkauf, R., Throwing light on dark states of alpha-oligothiophenes of chain lengths 2 to 6: radical anion photoelectron spectroscopy and excited-state theory, Phys. Chem. Chem. Phys., 2011, 13, 21, 10350-10363, https://doi.org/10.1039/c0cp02712j . [all data]