AgCl anion

Gas phase ion energetics data

Data compiled by: John E. Bartmess

Electron affinity of neutral species

EAneutral (eV) Reference Comment
1.593 ± 0.022Wu, Xie, et al., 2011

References

Wu, Xie, et al., 2011
Wu, X.; Xie, H.; Qin, Z.B.; Tan, K.; Tang, Z.C.; Lu, X., Photoelectron Imaging and Theoretical Studies of Silver Monohalides AgX- (X = Cl, Br, I) and AuCl-, J. Phys. Chem. A, 2011, 115, 24, 6321-6326, https://doi.org/10.1021/jp1100686 . [all data]