B18 anion

Gas phase ion energetics data

Data compiled by: John E. Bartmess

Electron affinity of neutral species

EAneutral (eV) Method Reference Comment
3.530 ± 0.050LPESSergeeva, Averkiev, et al., 2011

References

Sergeeva, Averkiev, et al., 2011
Sergeeva, A.P.; Averkiev, B.B.; Zhai, H.J.; Boldyrev, A.I.; Wang, L.S., All-boron analogues of aromatic hydrocarbons: B-17(-) and B-18(-), J. Chem. Phys., 2011, 134, 22, 224304, https://doi.org/10.1063/1.3599452 . [all data]