Fe6BO2 anion
- Formula: BFe6O2-
- Molecular weight: 377.880

Gas phase ion energetics data

Data compiled by: John E. Bartmess
Electron affinity of neutral species
EAneutral (eV) | Method | Reference | Comment |
---|---|---|---|
2.140 ± 0.080 | LPES | Feng, Xu, et al., 2010 | Vertical Detachment Energy: 2.45±0.08 eV |

References

Feng, Xu, et al., 2010
Feng, Y.A.; Xu, H.G.; Zhang, Z.G.; Gao, Z.; Zheng, W.,
Photoelectron Spectroscopy and Density Functional Calculations of Fen(BO2)- clusters.,
J. Chem. Phys., 2010, 132, 7, 074308, https://doi.org/10.1063/1.3299290
. [all data]