Cu2(BO2)2 anion

Gas phase ion energetics data

Data compiled by: John E. Bartmess

Electron affinity of neutral species

EAneutral (eV) Method Reference Comment
2.740 ± 0.040LPESFeng, Xu, et al., 2011Vertical Detachment Energy: 2.92±0.04 eV

References

Feng, Xu, et al., 2011
Feng, Y.A.; Xu, H.G.; Zheng, W.J.; Zhao, H.M.; Kandalam, A.K.; Jena, P., Structures and photoelectron spectroscopy of Cu-n(BO2)(m) - (n, m=1, 2) clusters: Observation of hyperhalogen behavior, J. Chem. Phys., 2011, 134, 9, 094309, https://doi.org/10.1063/1.3556818 . [all data]