pNMe2-C6H4CH2 anion

Reaction thermochemistry data

Data compiled by: John E. Bartmess

Individual Reactions

C9H12N- + Hydrogen cation = Benzenamine, N,N,4-trimethyl-

By formula: C9H12N- + H+ = C9H13N

Quantity Value Units Method Reference Comment
Δr1614. ± 21.kJ/molG+TSCaldwell and Bartmessgas phase
Quantity Value Units Method Reference Comment
Δr1586. ± 21.kJ/molIMRBCaldwell and Bartmessgas phase

References

Caldwell and Bartmess
Caldwell, G.; Bartmess, J.E., , Unpublished results. [all data]