pCOMe-C6H4CH2 anion

Gas phase ion energetics data

Data compiled by: John E. Bartmess

Protonation reactions

C9H9O- + Hydrogen cation = Ethanone, 1-(4-methylphenyl)-

By formula: C9H9O- + H+ = C9H10O

Quantity Value Units Method Reference Comment
Δr361.6 ± 2.1kcal/molG+TSTaft and Topsom, 1987gas phase; value altered from reference due to change in acidity scale
Quantity Value Units Method Reference Comment
Δr354.9 ± 2.0kcal/molIMRETaft and Topsom, 1987gas phase; value altered from reference due to change in acidity scale

References

Taft and Topsom, 1987
Taft, R.W.; Topsom, R.D., The Nature and Analysis of Substituent Effects, Prog. Phys. Org. Chem., 1987, 16, 1. [all data]