Pb2In2 anion

Gas phase ion energetics data

Data compiled by: John E. Bartmess

Electron affinity of neutral species

EAneutral (eV) Method Reference Comment
1.860 ± 0.050LPESMelko, Ong, et al., 2010Vertical Detachment Energy: 2.30±0.05 eV

References

Melko, Ong, et al., 2010
Melko, J.J.; Ong, S.V.; Gupta, U.; Reveles, J.U.; D'Emidio, J.; Khanna, S.N.; Castleman, A.W., Anion Photoelectron Spectroscopy and First-Principles Study of PbxIny Clusters, J. Phys. Chem. C, 2010, 114, 48, 20907-20916, https://doi.org/10.1021/jp1089432 . [all data]