11-beta-hydroxy-17-beta-estradiol(M-H) anion

Reaction thermochemistry data

Data compiled by: John E. Bartmess

Individual Reactions

C18H23O3- + Hydrogen cation = C18H24O3

By formula: C18H23O3- + H+ = C18H24O3

Quantity Value Units Method Reference Comment
Δr1416. ± 10.kJ/molCIDTBourgoin-Voillard, Zins, et al., 2009gas phase
Quantity Value Units Method Reference Comment
Δr1401. ± 12.kJ/molH-TSBourgoin-Voillard, Zins, et al., 2009gas phase

References

Bourgoin-Voillard, Zins, et al., 2009
Bourgoin-Voillard, S.; Zins, E.L.; Fournier, F.; Jacquot, Y.; Afonso, C.; Pepe, C.; Leclercq, G.; Tabet, J.C., Stereochemical Effects During [M-H](-) Dissociations of Epimeric 11-OH-17 beta-Estradiols and Distant Electronic Effects of Substituents at C-(11) Position on Gas Phase Acidity, J. Am. Soc. Mass Spectrom., 2009, 20, 12, 2318-2333, https://doi.org/10.1016/j.jasms.2009.08.017 . [all data]