H(NHCH2CO)3NHCH(CONH2)CH2S anion

Reaction thermochemistry data

Data compiled by: John E. Bartmess

Individual Reactions

C9H16N5O4S- + Hydrogen cation = C9H17N5O4S

By formula: C9H16N5O4S- + H+ = C9H17N5O4S

Quantity Value Units Method Reference Comment
Δr1397. ± 8.8kJ/molCIDCMorishetti, Huang, et al., 2010gas phase; Acid: (Gly)3CysNH2
Quantity Value Units Method Reference Comment
Δr1370. ± 9.2kJ/molH-TSMorishetti, Huang, et al., 2010gas phase; Acid: (Gly)3CysNH2

References

Morishetti, Huang, et al., 2010
Morishetti, K.K.; Huang, B.D.; Yates, J.M.; Ren, J.H., Gas-Phase Acidities of Cysteine-Polyglycine Peptides: The Effect of the Cysteine Position, J. Am. Soc. Mass Spectrom., 2010, 21, 4, 603-614, https://doi.org/10.1016/j.jasms.2009.12.008 . [all data]