mCl-C6H4CH2 anion

Gas phase ion energetics data

Data compiled by: John E. Bartmess

Electron affinity of neutral species

EAneutral (eV) Method Reference Comment
1.2720 ± 0.0080LPESKim, Wenthold, et al., 1999

Protonation reactions

C7H6Cl- + Hydrogen cation = Benzene, 1-chloro-3-methyl-

By formula: C7H6Cl- + H+ = C7H7Cl

Quantity Value Units Method Reference Comment
Δr374.0 ± 2.1kcal/molG+TSCaldwell and Bartmessgas phase; value altered from reference due to change in acidity scale
Quantity Value Units Method Reference Comment
Δr366.9 ± 2.0kcal/molIMRECaldwell and Bartmessgas phase; value altered from reference due to change in acidity scale

References

Kim, Wenthold, et al., 1999
Kim, J.B.; Wenthold, P.G.; Lineberger, W.C., Ultraviolet photoelectron spectroscopy of o-, m-, and p-halobenzyl anions, J. Phys. Chem. A, 1999, 103, 50, 10833-10841, https://doi.org/10.1021/jp992817o . [all data]

Caldwell and Bartmess
Caldwell, G.; Bartmess, J.E., , Unpublished results. [all data]