AlH3..F anion

Gas phase thermochemistry data

Data compiled by: John E. Bartmess

Quantity Value Units Method Reference Comment
Δfgas-510. ± 210.kJ/molTherWilliams and Wenthold, 2011

References

Williams and Wenthold, 2011
Williams, J.K.P.; Wenthold, P.G., Fluoride affinities of fluorinated alanes, Int. J. Mass Spectrom., 2011, 299, 1, 9-12, https://doi.org/10.1016/j.ijms.2010.09.003 . [all data]