MeOH..3,5-F2-C6H3CH2O anion

Ion clustering data

Data compiled by: John E. Bartmess

Clustering reactions

C7H5F2O- = C8H9F2O2-

By formula: C7H5F2O- = C8H9F2O2-

Quantity Value Units Method Reference Comment
Δr31.4kJ/molIMREMustanir, Matsuoka, et al., 2006gas phase

References

Mustanir, Matsuoka, et al., 2006
Mustanir; Matsuoka, M.; Mishima, M.; Koch, H., Stability of complexes of phenylacetylides and benzyl alkoxides with methanol in the gas phase. Acid-base correlation in the ionic hydrogen-bond strength, Bull. Chem. Soc. Japan, 2006, 79, 7, 1118-1125, https://doi.org/10.1246/bcsj.79.1118 . [all data]