MeOH..mF-C6H4CH2O anion

Ion clustering data

Data compiled by: John E. Bartmess

Clustering reactions

C7H6FO- = C8H10FO2-

By formula: C7H6FO- = C8H10FO2-

Quantity Value Units Method Reference Comment
Δr36.0kJ/molIMREMustanir, Matsuoka, et al., 2006gas phase

References

Mustanir, Matsuoka, et al., 2006
Mustanir; Matsuoka, M.; Mishima, M.; Koch, H., Stability of complexes of phenylacetylides and benzyl alkoxides with methanol in the gas phase. Acid-base correlation in the ionic hydrogen-bond strength, Bull. Chem. Soc. Japan, 2006, 79, 7, 1118-1125, https://doi.org/10.1246/bcsj.79.1118 . [all data]