MeOH..PhCH2O anion

Reaction thermochemistry data

Data compiled by: John E. Bartmess

Individual Reactions

C7H7O- = C8H11O2-

By formula: C7H7O- = C8H11O2-

Quantity Value Units Method Reference Comment
Δr49.79kJ/molIMREMustanir, Matsuoka, et al., 2006gas phase

References

Mustanir, Matsuoka, et al., 2006
Mustanir; Matsuoka, M.; Mishima, M.; Koch, H., Stability of complexes of phenylacetylides and benzyl alkoxides with methanol in the gas phase. Acid-base correlation in the ionic hydrogen-bond strength, Bull. Chem. Soc. Japan, 2006, 79, 7, 1118-1125, https://doi.org/10.1246/bcsj.79.1118 . [all data]