mNO-C6H4CH2 anion

Reaction thermochemistry data

Data compiled by: John E. Bartmess

Individual Reactions

C7H6NO- + Hydrogen cation = m-nitrosotoluene

By formula: C7H6NO- + H+ = C7H7NO

Quantity Value Units Method Reference Comment
Δr1539. ± 8.8kJ/molG+TSTaft and Topsom, 1987gas phase
Quantity Value Units Method Reference Comment
Δr1511. ± 8.4kJ/molIMRETaft and Topsom, 1987gas phase

References

Taft and Topsom, 1987
Taft, R.W.; Topsom, R.D., The Nature and Analysis of Substituent Effects, Prog. Phys. Org. Chem., 1987, 16, 1. [all data]