MeOH..mF-C6H4CC anion

Ion clustering data

Data compiled by: John E. Bartmess

Clustering reactions

C8H4F- = C9H8FO-

By formula: C8H4F- = C9H8FO-

Quantity Value Units Method Reference Comment
Δr33.9kJ/molIMREMustanir, Matsuoka, et al., 2006gas phase

References

Mustanir, Matsuoka, et al., 2006
Mustanir; Matsuoka, M.; Mishima, M.; Koch, H., Stability of complexes of phenylacetylides and benzyl alkoxides with methanol in the gas phase. Acid-base correlation in the ionic hydrogen-bond strength, Bull. Chem. Soc. Japan, 2006, 79, 7, 1118-1125, https://doi.org/10.1246/bcsj.79.1118 . [all data]