pCHO-C6H4CH2 anion

Gas phase ion energetics data

Data compiled by: John E. Bartmess

Protonation reactions

C8H7O- + Hydrogen cation = Benzaldehyde, 4-methyl-

By formula: C8H7O- + H+ = C8H8O

Quantity Value Units Method Reference Comment
Δr359.7 ± 2.4kcal/molG+TSKahn, Hehre, et al., 1984gas phase; value altered from reference due to change in acidity scale
Quantity Value Units Method Reference Comment
Δr352.6 ± 2.3kcal/molIMREKahn, Hehre, et al., 1984gas phase; value altered from reference due to change in acidity scale

References

Kahn, Hehre, et al., 1984
Kahn, S.D.; Hehre, W.J.; Bartmess, J.E.; Caldwell, G., Effect of Metal Complexation on the Gas-phase Acidities of Alkylbenzenes, Organomet., 1984, 3, 11, 1740, https://doi.org/10.1021/om00089a024 . [all data]