MeCl..I anion

Reaction thermochemistry data

Data compiled by: John E. Bartmess

Individual Reactions

Iodide = CH3ClI-

By formula: I- = CH3ClI-

Quantity Value Units Method Reference Comment
Δr8.07 ± 0.23kcal/molN/AVan Duzor, Wei, et al., 2010gas phase

Gas phase ion energetics data

Data compiled by: John E. Bartmess

Electron affinity of neutral species

EAneutral (eV) Method Reference Comment
3.410 ± 0.010LPESVan Duzor, Wei, et al., 2010

Ion clustering data

Data compiled by: John E. Bartmess

Clustering reactions

Iodide = CH3ClI-

By formula: I- = CH3ClI-

Quantity Value Units Method Reference Comment
Δr8.07 ± 0.23kcal/molN/AVan Duzor, Wei, et al., 2010gas phase

References

Van Duzor, Wei, et al., 2010
Van Duzor, M.; Wei, J.; Mbaiwa, F.; Mabbs, R., I-center dot CH3X (X=Cl, Br, I) photodetachment: The effect of electron-molecule interactions in cluster anion photodetachment spectra and angular distributions, J. Chem. Phys., 2010, 133, 14, 144303, https://doi.org/10.1063/1.3487739 . [all data]