1-Ph-cyclopropanide anion

Reaction thermochemistry data

Data compiled by: John E. Bartmess

Individual Reactions

C9H9- + Hydrogen cation = Benzene, cyclopropyl-

By formula: C9H9- + H+ = C9H10

Quantity Value Units Method Reference Comment
Δr1631. ± 13.kJ/molG+TSChou, Dahlke, et al., 1993gas phase; Between water, furan
Quantity Value Units Method Reference Comment
Δr1599. ± 13.kJ/molIMRBChou, Dahlke, et al., 1993gas phase; Between water, furan
Δr1607. ± 13.kJ/molIMRBAndrist, DePuy, et al., 1984gas phase

Gas phase ion energetics data

Data compiled by: John E. Bartmess

Protonation reactions

C9H9- + Hydrogen cation = Benzene, cyclopropyl-

By formula: C9H9- + H+ = C9H10

Quantity Value Units Method Reference Comment
Δr1631. ± 13.kJ/molG+TSChou, Dahlke, et al., 1993gas phase; Between water, furan
Quantity Value Units Method Reference Comment
Δr1599. ± 13.kJ/molIMRBChou, Dahlke, et al., 1993gas phase; Between water, furan
Δr1607. ± 13.kJ/molIMRBAndrist, DePuy, et al., 1984gas phase

References

Chou, Dahlke, et al., 1993
Chou, P.K.; Dahlke, G.D.; Kass, S.R., Unimolecular Rearrangements of Carbanions in the Gas Phase .2. Cyclopropyl Anions, J. Chem. Soc. Chem. Comm., 1993, 115, 1, 315, https://doi.org/10.1021/ja00054a045 . [all data]

Andrist, DePuy, et al., 1984
Andrist, A.H.; DePuy, C.H.; Squires, R.R., Structures of ssomeric anions in the gas phase: Arylallyl and arylcyclopropyl anions, J. Am. Chem. Soc., 1984, 106, 845. [all data]