Ga9N radical anion

Gas phase ion energetics data

Data compiled by: John E. Bartmess

Electron affinity of neutral species

EAneutral (eV) Method Reference Comment
2.40 ± 0.10LPESWang, Ko, et al., 2010Stated electron affinity is the Vertical Detachment Energy

References

Wang, Ko, et al., 2010
Wang, H.P.; Ko, Y.J.; Bowen, K.H.; Sergeeva, A.P.; Averkiev, B.B.; Boldyrev, A.I., Combined Experimental and Theoretical Investigation of Three-Dimensional, Nitrogen-Doped, Gallium Cluster Anions, J. Phys. Chem. A, 2010, 114, 42, 11070-11077, https://doi.org/10.1021/jp101419b . [all data]