C4B radical anion

Gas phase ion energetics data

Data compiled by: John E. Bartmess

Electron affinity of neutral species

EAneutral (eV) Method Reference Comment
4.990 ± 0.040LPESWang, Averkiev, et al., 2010

References

Wang, Averkiev, et al., 2010
Wang, L.M.; Averkiev, B.B.; Ramilowski, J.A.; Huang, W.; Wang, L.S.; Boldyrev, A.I., Planar to Linear Structural Transition in Small Boron-Carbon Mixed Clusters: CxB5-x- (x=1-5), J. Am. Chem. Soc., 2010, 132, 40, 14104-14112, https://doi.org/10.1021/ja103846q . [all data]