ScCl4 anion

Gas phase ion energetics data

Data compiled by: John E. Bartmess

Electron affinity of neutral species

EAneutral (eV) Method Reference Comment
6.84 ± 0.10LPESYang, Wang, et al., 2008Vertical Detachment Energy: 7.75±0.06 eV
6.890 ± 0.080LPESYang, Wang, et al., 2003Vertical Detachment Energy: 7.15±0.08 eV

References

Yang, Wang, et al., 2008
Yang, J.; Wang, X.-B.; Xing, X.-P.; Wang, L.-S., Photoelectron spectroscopy of anions at 118.2 nm: Observation of high electron binding energies in superhalogens MCl4- (M = Sc, Y, La), J. Chem. Phys., 2008, 128, 20, 201102, https://doi.org/10.1063/1.2938390 . [all data]

Yang, Wang, et al., 2003
Yang, X.; Wang, X.-B.; Wang, L.-S.; Niu, S.; Ichiye, T., On the electronic structures of gaseous transition metal halide complexes, FeX4- and MX3- (M = Mn, Fe, Co, Ni, X = Cl, Br), using photoelectron spectroscopy and density functional calculatio, J. Chem. Phys., 2003, 119, 16, 8311, https://doi.org/10.1063/1.1610431 . [all data]