pF-C6H4CH2 anion

Reaction thermochemistry data

Data compiled by: John E. Bartmess

Individual Reactions

C7H6F- + Hydrogen cation = Benzene, 1-fluoro-4-methyl-

By formula: C7H6F- + H+ = C7H7F

Quantity Value Units Method Reference Comment
Δr379.5 ± 2.1kcal/molG+TSCaldwell and Bartmessgas phase; value altered from reference due to change in acidity scale
Quantity Value Units Method Reference Comment
Δr372.4 ± 2.0kcal/molIMRECaldwell and Bartmessgas phase; value altered from reference due to change in acidity scale

Gas phase ion energetics data

Data compiled by: John E. Bartmess

Protonation reactions

C7H6F- + Hydrogen cation = Benzene, 1-fluoro-4-methyl-

By formula: C7H6F- + H+ = C7H7F

Quantity Value Units Method Reference Comment
Δr379.5 ± 2.1kcal/molG+TSCaldwell and Bartmessgas phase; value altered from reference due to change in acidity scale
Quantity Value Units Method Reference Comment
Δr372.4 ± 2.0kcal/molIMRECaldwell and Bartmessgas phase; value altered from reference due to change in acidity scale

References

Caldwell and Bartmess
Caldwell, G.; Bartmess, J.E., , Unpublished results. [all data]