Au3H anion

Gas phase ion energetics data

Data compiled by: John E. Bartmess

Electron affinity of neutral species

EAneutral (eV) Method Reference Comment
2.60 ± 0.25LPESFischer, Andreoni, et al., 2002Stated electron affinity is the Vertical Detachment Energy

References

Fischer, Andreoni, et al., 2002
Fischer, D.; Andreoni, W.; Curioni, A.; Gronbeck, H.; Burkart, S.; Gantefor, G., Chemisorption on Small Clusters: Canm Vertical Detachment Energy Measurements Provide Chemical Information? H on Au as a Case Study, Chem. Phys. Lett., 2002, 361, 5-6, 389, https://doi.org/10.1016/S0009-2614(02)00972-7 . [all data]