KrO anion

Gas phase ion energetics data

Data compiled by: John E. Bartmess

Electron affinity of neutral species

EAneutral (eV) Reference Comment
1.59960 ± 0.00060Garand, Buchachenko, et al., 2009

References

Garand, Buchachenko, et al., 2009
Garand, E.; Buchachenko, A.A.; Yacovitch, T.I.; Szczesniak, M.M.; Chalasinski, G.; Neumark, D.M., Study of KrO- and KrO via Slow Photoelectron Velocity-Map Imaging Spectroscopy and ab Initio Calculations, J. Phys. Chem. A, 2009, 113, 52, 14439-14446, https://doi.org/10.1021/jp903819m . [all data]