3,5-diCF3-C6H4C(Me)=NO anion

Reaction thermochemistry data

Data compiled by: John E. Bartmess

Individual Reactions

C10H6F6NO- + Hydrogen cation = C10H7F6NO

By formula: C10H6F6NO- + H+ = C10H7F6NO

Quantity Value Units Method Reference Comment
Δr339.9 ± 2.3kcal/molG+TSBadal and Mishima, 2010gas phase; (E) isomer
Quantity Value Units Method Reference Comment
Δr333.0 ± 2.2kcal/molIMREBadal and Mishima, 2010gas phase; (E) isomer

References

Badal and Mishima, 2010
Badal, M.M.R.; Mishima, M., Gas-Phase Acidities of Acetophenone Oximes. Substituent Effect and Solvent Effects, Bull. Chem. Soc. Japan, 2010, 83, 1, 58-65, https://doi.org/10.1246/bcsj.20090246 . [all data]