mNO2-C6H4C(Me)=NO anion

Gas phase ion energetics data

Data compiled by: John E. Bartmess

Protonation reactions

C8H7N2O3- + Hydrogen cation = (E)-1-(3-Nitrophenyl)ethanone oxime

By formula: C8H7N2O3- + H+ = C8H8N2O3

Quantity Value Units Method Reference Comment
Δr1433. ± 9.6kJ/molG+TSBadal and Mishima, 2010gas phase; (E) isomer
Quantity Value Units Method Reference Comment
Δr1405. ± 9.2kJ/molIMREBadal and Mishima, 2010gas phase; (E) isomer

References

Badal and Mishima, 2010
Badal, M.M.R.; Mishima, M., Gas-Phase Acidities of Acetophenone Oximes. Substituent Effect and Solvent Effects, Bull. Chem. Soc. Japan, 2010, 83, 1, 58-65, https://doi.org/10.1246/bcsj.20090246 . [all data]