H2O..naphthalene radical anion

Gas phase ion energetics data

Data compiled by: John E. Bartmess

Electron affinity of neutral species

EAneutral (eV) Method Reference Comment
0.030 ± 0.010LPESLee, Kim, et al., 2009Stated electron affinity is the Vertical Detachment Energy

References

Lee, Kim, et al., 2009
Lee, S.H.; Kim, J.H.; Chu, I.; Song, J.K., Anion clusters of naphthalene and solvents: structure, ion core, and intermolecular interactions, Phys. Chem. Chem. Phys., 2009, 11, 41, 9468-9473, https://doi.org/10.1039/b903626a . [all data]