H2N-(COCHMeNH)4-COCH(NH2)CH2S- [[CysAla4NH2]

Reaction thermochemistry data

Data compiled by: John E. Bartmess

Individual Reactions

C15H27N6O5S + Hydrogen cation = C15H28N6O5S

By formula: C15H27N6O5S + H+ = C15H28N6O5S

Quantity Value Units Method Reference Comment
Δr1336. ± 17.kJ/molCIDCRen, Tan, et al., 2009gas phase; acid:H2N-Cys-(Ala)3-CHMeCONH2
Quantity Value Units Method Reference Comment
Δr1320. ± 17.kJ/molH-TSRen, Tan, et al., 2009gas phase; acid:H2N-Cys-(Ala)3-CHMeCONH2

References

Ren, Tan, et al., 2009
Ren, J.H.; Tan, J.P.; Harper, R.T., Gas-Phase Acidities of Cysteine-Polyalanine Peptides I: A(3,4)CSH and HSCA(3,4), J. Phys. Chem. A, 2009, 113, 41, 10903-10912, https://doi.org/10.1021/jp903594a . [all data]