(MeOH)3..MeCO2 anion

Gas phase ion energetics data

Data compiled by: John E. Bartmess

Electron affinity of neutral species

EAneutral (eV) Method Reference Comment
5.000 ± 0.050LPESWang, Jagoda-Cwiklik, et al., 2009

References

Wang, Jagoda-Cwiklik, et al., 2009
Wang, X.B.; Jagoda-Cwiklik, B.; Chi, C.X.; Xing, X.P.; Zhou, M.F.; Jungwirth, P.; Wang, L.S., Microsolvation of the acetate anion [CH3CO2-(H2O)(n), n=1-3]: A photoelectron spectroscopy and ab initio computational study, Chem. Phys. Lett., 2009, 477, 1-3, 41-44, https://doi.org/10.1016/j.cplett.2009.06.074 . [all data]