PhSO2CHEt anion

Reaction thermochemistry data

Data compiled by: John E. Bartmess

Individual Reactions

C9H11O2S- + Hydrogen cation = Benzene, (propylsulfonyl)-

By formula: C9H11O2S- + H+ = C9H12O2S

Quantity Value Units Method Reference Comment
Δr364.1 ± 2.0kcal/molG+TSCumming and Kebarle, 1978gas phase
Quantity Value Units Method Reference Comment
Δr356.3 ± 2.0kcal/molIMRECumming and Kebarle, 1978gas phase

Gas phase ion energetics data

Data compiled by: John E. Bartmess

Protonation reactions

C9H11O2S- + Hydrogen cation = Benzene, (propylsulfonyl)-

By formula: C9H11O2S- + H+ = C9H12O2S

Quantity Value Units Method Reference Comment
Δr364.1 ± 2.0kcal/molG+TSCumming and Kebarle, 1978gas phase
Quantity Value Units Method Reference Comment
Δr356.3 ± 2.0kcal/molIMRECumming and Kebarle, 1978gas phase

References

Cumming and Kebarle, 1978
Cumming, J.B.; Kebarle, P., Summary of gas phase measurements involving acids AH. Entropy changes in proton transfer reactions involving negative ions. Bond dissociation energies D(A-H) and electron affinities EA(A), Can. J. Chem., 1978, 56, 1. [all data]