CO2..IBr anion

Gas phase ion energetics data

Data compiled by: John E. Bartmess

Electron affinity of neutral species

EAneutral (eV) Method Reference Comment
2.670 ± 0.030LPESSheps, Miller, et al., 2009Vertical Detachment Energy: 3.504 eV

References

Sheps, Miller, et al., 2009
Sheps, L.; Miller, E.M.; Lineberger, W.C., Photoelectron spectroscopy of small IBr-(CO2)(n), (n=0-3) cluster anions, J. Chem. Phys., 2009, 131, 6, 064304, https://doi.org/10.1063/1.3200941 . [all data]