MeSO2CH2 anion

Reaction thermochemistry data

Data compiled by: John E. Bartmess

Individual Reactions

C2H5O2S- + Hydrogen cation = Dimethyl sulfone

By formula: C2H5O2S- + H+ = C2H6O2S

Quantity Value Units Method Reference Comment
Δr365.8 ± 2.2kcal/molG+TSBartmess, Scott, et al., 1979gas phase; value altered from reference due to change in acidity scale
Δr366.5 ± 2.9kcal/molG+TSCumming and Kebarle, 1978gas phase
Quantity Value Units Method Reference Comment
Δr358.2 ± 2.0kcal/molIMREBartmess, Scott, et al., 1979gas phase; value altered from reference due to change in acidity scale
Δr358.9 ± 2.0kcal/molIMRECumming and Kebarle, 1978gas phase

References

Bartmess, Scott, et al., 1979
Bartmess, J.E.; Scott, J.A.; McIver, R.T., Jr., The gas phase acidity scale from methanol to phenol, J. Am. Chem. Soc., 1979, 101, 6047. [all data]

Cumming and Kebarle, 1978
Cumming, J.B.; Kebarle, P., Summary of gas phase measurements involving acids AH. Entropy changes in proton transfer reactions involving negative ions. Bond dissociation energies D(A-H) and electron affinities EA(A), Can. J. Chem., 1978, 56, 1. [all data]