MeSOCH2 anion

Reaction thermochemistry data

Data compiled by: John E. Bartmess

Individual Reactions

C2H5OS- + Hydrogen cation = Dimethyl Sulfoxide

By formula: C2H5OS- + H+ = C2H6OS

Quantity Value Units Method Reference Comment
Δr1563. ± 8.8kJ/molG+TSBartmess, Scott, et al., 1979gas phase; value altered from reference due to change in acidity scale
Δr1566. ± 9.6kJ/molG+TSCumming and Kebarle, 1978gas phase
Quantity Value Units Method Reference Comment
Δr1533. ± 8.4kJ/molIMREBartmess, Scott, et al., 1979gas phase; value altered from reference due to change in acidity scale
Δr1536. ± 8.4kJ/molIMRECumming and Kebarle, 1978gas phase

References

Bartmess, Scott, et al., 1979
Bartmess, J.E.; Scott, J.A.; McIver, R.T., Jr., The gas phase acidity scale from methanol to phenol, J. Am. Chem. Soc., 1979, 101, 6047. [all data]

Cumming and Kebarle, 1978
Cumming, J.B.; Kebarle, P., Summary of gas phase measurements involving acids AH. Entropy changes in proton transfer reactions involving negative ions. Bond dissociation energies D(A-H) and electron affinities EA(A), Can. J. Chem., 1978, 56, 1. [all data]