Si9Y anion

Gas phase ion energetics data

Data compiled by: John E. Bartmess

Electron affinity of neutral species

EAneutral (eV) Method Reference Comment
2.7000 ± 0.0043LPESKoyasu, Atobe, et al., 2008

References

Koyasu, Atobe, et al., 2008
Koyasu, K.; Atobe, J.; Furuse, S.; Nakajima, A., Anion photoelectron spectroscopy of transition metal- and lanthanide metal-silicon clusters: MSin- (n=6-20), J. Chem. Phys., 2008, 129, 21, 214301, https://doi.org/10.1063/1.3023080 . [all data]