mCF3-C6H4CHCN anion

Gas phase ion energetics data

Data compiled by: John E. Bartmess

Protonation reactions

C9H5F3N- + Hydrogen cation = Benzeneacetonitrile, 3-(trifluoromethyl)-

By formula: C9H5F3N- + H+ = C9H6F3N

Quantity Value Units Method Reference Comment
Δr1431. ± 10.kJ/molG+TSTaft and Topsom, 1987gas phase
Quantity Value Units Method Reference Comment
Δr1403. ± 8.4kJ/molIMRETaft and Topsom, 1987gas phase

References

Taft and Topsom, 1987
Taft, R.W.; Topsom, R.D., The Nature and Analysis of Substituent Effects, Prog. Phys. Org. Chem., 1987, 16, 1. [all data]