pNO2-C6H4CHCN anion

Gas phase ion energetics data

Data compiled by: John E. Bartmess

Protonation reactions

C8H5N2O2- + Hydrogen cation = Benzeneacetonitrile, 4-nitro-

By formula: C8H5N2O2- + H+ = C8H6N2O2

Quantity Value Units Method Reference Comment
Δr1378. ± 9.6kJ/molG+TSFujio, McIver, et al., 1981gas phase; value altered from reference due to change in acidity scale
Quantity Value Units Method Reference Comment
Δr1350. ± 8.4kJ/molIMREFujio, McIver, et al., 1981gas phase; value altered from reference due to change in acidity scale

Reaction thermochemistry data

Data compiled by: John E. Bartmess

Individual Reactions

C8H5N2O2- + Hydrogen cation = Benzeneacetonitrile, 4-nitro-

By formula: C8H5N2O2- + H+ = C8H6N2O2

Quantity Value Units Method Reference Comment
Δr1378. ± 9.6kJ/molG+TSFujio, McIver, et al., 1981gas phase; value altered from reference due to change in acidity scale
Quantity Value Units Method Reference Comment
Δr1350. ± 8.4kJ/molIMREFujio, McIver, et al., 1981gas phase; value altered from reference due to change in acidity scale

References

Fujio, McIver, et al., 1981
Fujio, M.; McIver, R.T., Jr.; Taft, R.W., Effects on the acidities of phenols from specific substituent-solvent interactions. Inherent substituent parameters from gas phase acidities, J. Am. Chem. Soc., 1981, 103, 4017. [all data]