(COT)3Eu2 anion

Gas phase ion energetics data

Data compiled by: John E. Bartmess

Electron affinity of neutral species

EAneutral (eV) Method Reference Comment
2.10 ± 0.10LPESHosoya, Takegami, et al., 2005Vertical Detachment Energy: 2.6 eV

References

Hosoya, Takegami, et al., 2005
Hosoya, N.; Takegami, R.; Suzumura, J.; Yada, K.; Koyasu, K.; Miyajima, K.; Mitsui, M.; Knickelbein, M.B.; Yabushita, S.; Nakajima, A., Lanthanide organometallic sandwich nanowires: Formation mechanism, J. Phys. Chem. A, 2005, 109, 1, 9-12, https://doi.org/10.1021/jp0452103 . [all data]