pMe-C6H4CHCN anion

Gas phase ion energetics data

Data compiled by: John E. Bartmess

Protonation reactions

C9H8N- + Hydrogen cation = Benzeneacetonitrile, 4-methyl-

By formula: C9H8N- + H+ = C9H9N

Quantity Value Units Method Reference Comment
Δr351.6 ± 2.5kcal/molG+TSTaft, 1987gas phase; value altered from reference due to change in acidity scale
Quantity Value Units Method Reference Comment
Δr345.0 ± 2.0kcal/molIMRETaft, 1987gas phase; value altered from reference due to change in acidity scale

Reaction thermochemistry data

Data compiled by: John E. Bartmess

Individual Reactions

C9H8N- + Hydrogen cation = Benzeneacetonitrile, 4-methyl-

By formula: C9H8N- + H+ = C9H9N

Quantity Value Units Method Reference Comment
Δr351.6 ± 2.5kcal/molG+TSTaft, 1987gas phase; value altered from reference due to change in acidity scale
Quantity Value Units Method Reference Comment
Δr345.0 ± 2.0kcal/molIMRETaft, 1987gas phase; value altered from reference due to change in acidity scale

References

Taft, 1987
Taft, R.W., The Nature and Analysis of Substitutent Electronic Effects, Personal communication. See also Prog. Phys. Org. Chem., 1987, 16, 1. [all data]